Target
Transthyretin
Ligand
BDBM50197883
Substrate
Meas. Tech.
ChEMBL_1670047 (CHEMBL4019935)
Kd
370±n/a nM
Citation
 Smith, TPWindsor, IWForest, KTRaines, RT Stilbene Boronic Acids Form a Covalent Bond with Human Transthyretin and Inhibit Its Aggregation. J Med Chem 60:7820-7834 (2017)  
Target
Name:
Transthyretin
Synonyms:
ATTR Prealbumin TTHY_HUMAN Transthyretin (TTR)
Type:
Enzyme
Mol. Mass.:
15884.31
Organism:
Homo sapiens (Human)
Description:
P02766
Residue:
147
  
Inhibitor
Name:
BDBM50197883
Synonyms:
CHEBI:78538 Tafamidis Vyndaqel
Type:
Small organic molecule
Emp. Form.:
C14H7Cl2NO3
Mol. Mass.:
308.116
SMILES:
OC(=O)c1ccc2nc(oc2c1)-c1cc(Cl)cc(Cl)c1
: