Target
Aldo-keto reductase family 1 member C4
Ligand
BDBM50241828
Substrate
Meas. Tech.
ChEMBL_1670547 (CHEMBL4020435)
IC50
350±n/a nM
Citation
 Endo, SXia, SSuyama, MMorikawa, YOguri, HHu, DAo, YTakahara, SHorino, YHayakawa, YWatanabe, YGouda, HHara, AKuwata, KToyooka, NMatsunaga, TIkari, A Synthesis of Potent and Selective Inhibitors of Aldo-Keto Reductase 1B10 and Their Efficacy against Proliferation, Metastasis, and Cisplatin Resistance of Lung Cancer Cells. J Med Chem 60:8441-8455 (2017)  
Target
Name:
Aldo-keto reductase family 1 member C4
Synonyms:
3-alpha-HSD1 3-alpha-hydroxysteroid dehydrogenase type I AKR1C4 Aldo-keto reductase family 1 member C4 (AK1C4) CHDR DD-4 Dihydrodiol dehydrogenase 4 | HAKRA
Type:
Enzyme
Mol. Mass.:
37068.40
Organism:
Homo sapiens (Human)
Description:
P17516
Residue:
323
  
Inhibitor
Name:
BDBM50241828
Synonyms:
CHEMBL4089817
Type:
Small organic molecule
Emp. Form.:
C19H16FNO4
Mol. Mass.:
341.333
SMILES:
Oc1ccc2cc(C(=O)NCCCc3ccc(F)cc3)c(=O)oc2c1
: