Target
Carbonyl reductase [NADPH] 1
Ligand
BDBM50241817
Substrate
Meas. Tech.
ChEMBL_1670548 (CHEMBL4020436)
IC50
4200±n/a nM
Citation
 Endo, SXia, SSuyama, MMorikawa, YOguri, HHu, DAo, YTakahara, SHorino, YHayakawa, YWatanabe, YGouda, HHara, AKuwata, KToyooka, NMatsunaga, TIkari, A Synthesis of Potent and Selective Inhibitors of Aldo-Keto Reductase 1B10 and Their Efficacy against Proliferation, Metastasis, and Cisplatin Resistance of Lung Cancer Cells. J Med Chem 60:8441-8455 (2017)  
Target
Name:
Carbonyl reductase [NADPH] 1
Synonyms:
CBR CBR1_HUMAN SDR21C1
Type:
PROTEIN
Mol. Mass.:
30380.63
Organism:
Homo sapiens (Human)
Description:
ChEMBL_607770
Residue:
277
  
Inhibitor
Name:
BDBM50241817
Synonyms:
CHEMBL4081954
Type:
Small organic molecule
Emp. Form.:
C19H17NO5
Mol. Mass.:
339.342
SMILES:
Oc1ccc(CCCNC(=O)c2cc3ccc(O)cc3oc2=O)cc1
: