Target
Aldo-keto reductase family 1 member B10
Ligand
BDBM200221
Substrate
Meas. Tech.
ChEMBL_1670580 (CHEMBL4020468)
IC50
80±n/a nM
Citation
 Endo, SXia, SSuyama, MMorikawa, YOguri, HHu, DAo, YTakahara, SHorino, YHayakawa, YWatanabe, YGouda, HHara, AKuwata, KToyooka, NMatsunaga, TIkari, A Synthesis of Potent and Selective Inhibitors of Aldo-Keto Reductase 1B10 and Their Efficacy against Proliferation, Metastasis, and Cisplatin Resistance of Lung Cancer Cells. J Med Chem 60:8441-8455 (2017)  
Target
Name:
Aldo-keto reductase family 1 member B10
Synonyms:
AK1BA_HUMAN AKR1B11 ARP Aldo-keto reductase family 1 member B10 (AKR1B10) Aldose reductase-like SI reductase hARP
Type:
Protein
Mol. Mass.:
36024.67
Organism:
Homo sapiens (Human)
Description:
O60218. 1ZUA; 4JII; 4GQ0
Residue:
316
  
Inhibitor
Name:
BDBM200221
Synonyms:
2-(5-chloro-2-(((perbromophenyl)methyl)carbamoyl)phenoxy)acetic acid | MK204
Type:
Small organic molecule
Emp. Form.:
C16H9Br5ClNO4
Mol. Mass.:
714.22
SMILES:
OC(=O)COc1cc(Cl)ccc1C(=O)NCc1c(Br)c(Br)c(Br)c(Br)c1Br
: