Target
RAS guanyl-releasing protein 1
Ligand
BDBM50241846
Substrate
Meas. Tech.
ChEMBL_1670921 (CHEMBL4020950)
Ki
40±n/a nM
Citation
 Elhalem, EDonadío, LGZhou, XLewin, NEGarcia, LCLai, CCKelley, JAPeach, MLBlumberg, PMComin, MJ Exploring the influence of indololactone structure on selectivity for binding to the C1 domains of PKC?, PKC?, and RasGRP. Bioorg Med Chem 25:2971-2980 (2017)  
Target
Name:
RAS guanyl-releasing protein 1
Synonyms:
CalDAG-GEFII GRP1_HUMAN RASGRP1 | Ras guanyl-releasing protein
Type:
PROTEIN
Mol. Mass.:
90418.98
Organism:
Homo sapiens (Human)
Description:
ChEMBL_102739
Residue:
797
  
Inhibitor
Name:
BDBM50241846
Synonyms:
CHEMBL4069954
Type:
Small organic molecule
Emp. Form.:
C32H27NO5
Mol. Mass.:
505.5605
SMILES:
Cc1ccc(cc1)C#Cc1ccc(\C=C2/CC(CO)(COC(=O)c3cn(C)c4ccccc34)OC2=O)cc1
: