Target
Acetylcholinesterase
Ligand
BDBM50241991
Substrate
Meas. Tech.
ChEMBL_1671087 (CHEMBL4021116)
Kd
2000±n/a nM
Citation
 Mohammed, ASneathen, JFrojen, SGKuo, LDupureur, CM Stereospecific cholinesterase inhibition by O,S-diethylphenylphosphonothioate. Bioorg Med Chem 25:3053-3058 (2017)  
Target
Name:
Acetylcholinesterase
Synonyms:
ACES_ELEEL Acetylcholinesterase (EeAChE) | ache
Type:
Enzyme
Mol. Mass.:
71812.79
Organism:
Electrophorus electricus (Electric eel)
Description:
Residue:
633
  
Inhibitor
Name:
BDBM50241991
Synonyms:
CHEMBL4085438
Type:
Small organic molecule
Emp. Form.:
C10H24NO2PS
Mol. Mass.:
253.342
SMILES:
COP(C)(=O)SCCN(C(C)C)C(C)C
: