Target
Serine/threonine-protein kinase mTOR
Ligand
BDBM50429701
Substrate
Meas. Tech.
ChEBML_1672555
IC50
2.8±n/a nM
Citation
 Al-Ashmawy, AAKRagab, FAElokely, KMAnwar, MMPerez-Leal, ORico, MCGordon, JBichenkov, EMateo, GKassem, EMMHegazy, GHAbou-Gharbia, MChilders, W Design, synthesis and SAR of new-di-substituted pyridopyrimidines as ATP-competitive dual PI3K?/mTOR inhibitors. Bioorg Med Chem Lett 27:3117-3122 (2017)  
Target
Name:
Serine/threonine-protein kinase mTOR
Synonyms:
FK506-binding protein 12-rapamycin complex-associated protein 1 FRAP FRAP1 MTOR Mammalian Target of Rapamycin (mTOR) RAFT1 Rapamycin and FKBP12 target 1 Serine/threonine-protein kinase (mTOR) | mTORC2
Type:
Rapamycin target protein
Mol. Mass.:
288917.12
Organism:
Homo sapiens (Human)
Description:
P42345
Residue:
2549
  
Inhibitor
Name:
BDBM50429701
Synonyms:
AZD-2014 US9102670, 1ap
Type:
Small organic molecule
Emp. Form.:
C25H30N6O3
Mol. Mass.:
462.5441
SMILES:
CNC(=O)c1cccc(c1)-c1ccc2c(nc(nc2n1)N1CCOC[C@@H]1C)N1CCOC[C@@H]1C
: