Target
Vascular endothelial growth factor receptor 2
Ligand
BDBM50325983
Substrate
Meas. Tech.
ChEMBL_1672666 (CHEMBL4022695)
IC50
>5000±n/a nM
Citation
 Wagman, ASBoyce, RSBrown, SPFang, EGoff, DJansen, JMLe, VPLevine, BHNg, SCNi, ZJNuss, JMPfister, KBRamurthy, SRenhowe, PARing, DBShu, WSubramanian, SZhou, XAShafer, CMHarrison, SDJohnson, KWBussiere, DE Synthesis, Binding Mode, and Antihyperglycemic Activity of Potent and Selective (5-Imidazol-2-yl-4-phenylpyrimidin-2-yl)[2-(2-pyridylamino)ethyl]amine Inhibitors of Glycogen Synthase Kinase 3. J Med Chem 60:8482-8514 (2017)  
Target
Name:
Vascular endothelial growth factor receptor 2
Synonyms:
CD_antigen=CD309 Fetal liver kinase 1 (FLK-1) KDR Protein-tyrosine kinase receptor Flk-1 VEGFR-2 VEGFR2 Vascular Endothelial Growth Factor Receptor Kinase 2 Vascular endothelial growth factor receptor 2 (KDR) Vascular endothelial growth factor receptor 2 (VEGFR2) Vascular endothelial growth factor receptor-2 (VEGFR-2)
Type:
Receptor Tyrosine Kinase
Mol. Mass.:
151510.97
Organism:
Homo sapiens (Human)
Description:
P35968
Residue:
1356
  
Inhibitor
Name:
BDBM50325983
Synonyms:
6-(2-(4-(2,4-dichlorophenyl)-5-(4-methyl-1H-imidazol-2-yl)pyrimidin-2-ylamino)ethylamino)nicotinonitrile CHIR-99021 US11203601, Compound Table 1.19
Type:
Small organic molecule
Emp. Form.:
C22H18Cl2N8
Mol. Mass.:
465.338
SMILES:
Cc1c[nH]c(n1)-c1cnc(NCCNc2ccc(cn2)C#N)nc1-c1ccc(Cl)cc1Cl
: