Target
Phospholipase A-2-activating protein
Ligand
BDBM50245461
Substrate
Meas. Tech.
ChEMBL_1674708 (CHEMBL4024851)
IC50
36±n/a nM
Citation
 Jackson, PAWiden, JCHarki, DABrummond, KM Covalent Modifiers: A Chemical Perspective on the Reactivity of?,?-Unsaturated Carbonyls with Thiols via Hetero-Michael Addition Reactions. J Med Chem 60:839-885 (2017)  
Target
Name:
Phospholipase A-2-activating protein
Synonyms:
PLAA PLAP_HUMAN
Type:
PROTEIN
Mol. Mass.:
87154.11
Organism:
Homo sapiens (Human)
Description:
ChEMBL_610122
Residue:
795
  
Inhibitor
Name:
BDBM50245461
Synonyms:
CHEMBL4068569
Type:
Small organic molecule
Emp. Form.:
C19H21FO7
Mol. Mass.:
380.3642
SMILES:
COc1cc(O)c2c(c1)\C=C\C[C@H](O)[C@H](O)C(=O)\C(F)=C/C[C@H](C)OC2=O
: