Target
Mitogen-activated protein kinase 8
Ligand
BDBM86633
Substrate
Meas. Tech.
ChEMBL_1674680 (CHEMBL4024823)
IC50
1.000000±n/a nM
Citation
 Jackson, PAWiden, JCHarki, DABrummond, KM Covalent Modifiers: A Chemical Perspective on the Reactivity of?,?-Unsaturated Carbonyls with Thiols via Hetero-Michael Addition Reactions. J Med Chem 60:839-885 (2017)  
Target
Name:
Mitogen-activated protein kinase 8
Synonyms:
JNK-46 JNK1-alpha-1 MK08_HUMAN PRKM8 SAPK1C c-Jun N-terminal kinase 1 c-Jun N-terminal kinase 1(JNK1) | c-Jun N-terminal kinase 2 (JNK2)
Type:
Enzyme
Mol. Mass.:
48297.57
Organism:
Homo sapiens (Human)
Description:
JNK-1 was purchased from Upstate Cell Signaling Solutions (formerly Upstate Biotechnology).
Residue:
427
  
Inhibitor
Name:
BDBM86633
Synonyms:
JNK-IN-8
Type:
Small organic molecule
Emp. Form.:
C29H29N7O2
Mol. Mass.:
507.5863
SMILES:
CN(C)C\C=C\C(=O)Nc1cccc(c1)C(=O)Nc1ccc(Nc2nccc(n2)-c2cccnc2)c(C)c1
: