Target
Renin
Ligand
BDBM50004402
Substrate
Meas. Tech.
ChEBML_195957
IC50
34±n/a nM
Citation
 Ashton, WTCantone, CLTolman, RLGreenlee, WJLynch, RJSchorn, TWStrouse, JFSiegl, PK Inhibitors of human renin with C-termini derived from amides and esters of alpha-mercaptoalkanoic acids. J Med Chem 35:2772-81 (1992)  
Target
Name:
Renin
Synonyms:
Angiotensinogenase RENI_HUMAN
Type:
Enzyme
Mol. Mass.:
45058.99
Organism:
Homo sapiens (Human)
Description:
Residue:
406
  
Inhibitor
Name:
BDBM50004402
Synonyms:
CHEMBL420633 | {1-[1-{3-[(1-Benzyl-piperidin-4-ylcarbamoyl)-methanesulfonyl]-1-cyclohexylmethyl-2-hydroxy-propylcarbamoyl}-2-(1H-imidazol-4-yl)-ethylcarbamoyl]-2-phenyl-ethyl}-carbamic acid tert-butyl ester
Type:
Small organic molecule
Emp. Form.:
C44H63N7O8S
Mol. Mass.:
850.078
SMILES:
CC(C)(C)OC(=O)N[C@@H](Cc1ccccc1)C(=O)N[C@@H](Cc1cnc[nH]1)C(=O)N[C@@H](CC1CCCCC1)[C@@H](O)CS(=O)(=O)CC(=O)NC1CCN(Cc2ccccc2)CC1
: