Target
Protein arginine N-methyltransferase 3
Ligand
BDBM50427768
Substrate
Meas. Tech.
ChEMBL_1677674 (CHEMBL4027817)
IC50
2500±n/a nM
Citation
 Kaniskan, HÜEram, MSZhao, KSzewczyk, MMYang, XSchmidt, KLuo, XXiao, SDai, MHe, FZang, ILin, YLi, FDobrovetsky, ESmil, DMin, SJLin-Jones, JSchapira, MAtadja, PLi, EBarsyte-Lovejoy, DArrowsmith, CHBrown, PJLiu, FYu, ZVedadi, MJin, J Discovery of Potent and Selective Allosteric Inhibitors of Protein Arginine Methyltransferase 3 (PRMT3). J Med Chem 61:1204-1217 (2018)  
Target
Name:
Protein arginine N-methyltransferase 3
Synonyms:
2.1.1.- HRMT1L3 PRMT3 | Protein arginine N-methyltransferase 3
Type:
PROTEIN
Mol. Mass.:
59886.87
Organism:
Homo sapiens
Description:
ChEMBL_101368
Residue:
531
  
Inhibitor
Name:
BDBM50427768
Synonyms:
CHEMBL2325441
Type:
Small organic molecule
Emp. Form.:
C15H18N4OS
Mol. Mass.:
302.395
SMILES:
O=C(NCCC1=CCCCC1)Nc1ccc2nnsc2c1
: