Target
Muscarinic acetylcholine receptor
Ligand
BDBM50004729
Substrate
Meas. Tech.
ChEMBL_138302 (CHEMBL744332)
EC50
>300000±n/a nM
Citation
 Nilsson, BMVargas, HMHacksell, U Urea and 2-imidazolidone derivatives of the muscarinic agents oxotremorine and N-methyl-N-(1-methyl-4-pyrrolidino-2-butynyl)acetamide. J Med Chem 35:3270-9 (1992)  
Target
Name:
Muscarinic acetylcholine receptor
Synonyms:
GPM3 | Muscarinic acetylcholine receptor M3
Type:
Mol. Mass.:
66272.13
Organism:
Cavia porcellus
Description:
Residue:
587
  
Inhibitor
Name:
BDBM50004729
Synonyms:
1-Acetyl-3-(4-pyrrolidin-1-yl-but-2-ynyl)-imidazolidin-2-one | CHEMBL111521
Type:
Small organic molecule
Emp. Form.:
C13H19N3O2
Mol. Mass.:
249.3089
SMILES:
CC(=O)N1CCN(CC#CCN2CCCC2)C1=O
: