Target
Muscarinic acetylcholine receptor
Ligand
BDBM50004731
Substrate
Meas. Tech.
ChEMBL_138302 (CHEMBL744332)
EC50
46400±n/a nM
Citation
 Nilsson, BMVargas, HMHacksell, U Urea and 2-imidazolidone derivatives of the muscarinic agents oxotremorine and N-methyl-N-(1-methyl-4-pyrrolidino-2-butynyl)acetamide. J Med Chem 35:3270-9 (1992)  
Target
Name:
Muscarinic acetylcholine receptor
Synonyms:
GPM3 | Muscarinic acetylcholine receptor M3
Type:
Mol. Mass.:
66272.13
Organism:
Cavia porcellus
Description:
Residue:
587
  
Inhibitor
Name:
BDBM50004731
Synonyms:
3-(4-Pyrrolidin-1-yl-but-2-ynyl)-imidazolidine-2,4-dione | CHEMBL111467
Type:
Small organic molecule
Emp. Form.:
C11H15N3O2
Mol. Mass.:
221.2557
SMILES:
Oc1c[nH]c(=O)n1CC#CCN1CCCC1
: