Target
Muscarinic acetylcholine receptor
Ligand
BDBM50004734
Substrate
Meas. Tech.
ChEBML_138302
Kd
240±n/a nM
Citation
 Nilsson, BMVargas, HMHacksell, U Urea and 2-imidazolidone derivatives of the muscarinic agents oxotremorine and N-methyl-N-(1-methyl-4-pyrrolidino-2-butynyl)acetamide. J Med Chem 35:3270-9 (1992)  
Target
Name:
Muscarinic acetylcholine receptor
Synonyms:
GPM3 | Muscarinic acetylcholine receptor M3
Type:
Mol. Mass.:
66272.13
Organism:
Cavia porcellus
Description:
Residue:
587
  
Inhibitor
Name:
BDBM50004734
Synonyms:
CHEMBL310852 N-Methyl-N-(1-methyl-4-pyrrolidin-1-yl-but-2-ynyl)-acetamide (BM 5) N-Methyl-N-(1-methyl-4-pyrrolidin-1-yl-but-2-ynyl)-acetamide (S)
Type:
Small organic molecule
Emp. Form.:
C12H20N2O
Mol. Mass.:
208.3
SMILES:
CC(C#CCN1CCCC1)N(C)C(C)=O
: