Target
Envelope glycoprotein
Ligand
BDBM78577
Substrate
Meas. Tech.
ChEMBL_1677814 (CHEMBL4027957)
Kd
290000±n/a nM
Citation
 Ren, JZhao, YFry, EEStuart, DI Target Identification and Mode of Action of Four Chemically Divergent Drugs against Ebolavirus Infection. J Med Chem 61:724-733 (2018)  
Target
Name:
Envelope glycoprotein
Synonyms:
Envelope glycoprotein GP1 GP1,2-delta Shed GP | VGP_EBOZM
Type:
PROTEIN
Mol. Mass.:
74464.56
Organism:
Zaire ebolavirus (strain Mayinga-76) (ZEBOV) (Zaire Ebola virus)
Description:
ChEMBL_117434
Residue:
676
  
Inhibitor
Name:
BDBM78577
Synonyms:
BEPRIDIL HYDROCHLORIDE MLS000028456 N-[3-(2-methylpropoxy)-2-pyrrolidin-1-yl-propyl]-N-(phenylmethyl)aniline;hydrochloride SMR000058419 cid_50088
Type:
Small organic molecule
Emp. Form.:
C24H34N2O
Mol. Mass.:
366.5396
SMILES:
CC(C)COCC(CN(Cc1ccccc1)c1ccccc1)N1CCCC1
: