Target
Bile salt export pump
Ligand
BDBM50248151
Substrate
Meas. Tech.
ChEMBL_1678644 (CHEMBL4028921)
IC50
>133000±n/a nM
Citation
 Morgan, REvan Staden, CJChen, YKalyanaraman, NKalanzi, JDunn, RTAfshari, CAHamadeh, HK A multifactorial approach to hepatobiliary transporter assessment enables improved therapeutic compound development. Toxicol Sci 136:216-41 (2013)  
Target
Name:
Bile salt export pump
Synonyms:
ABCB11 ATP-binding cassette sub-family B member 11 Bile Salt Export Pump, BSEP Bile salt export pump (BSEP)
Type:
Protein
Mol. Mass.:
146405.49
Organism:
Homo sapiens (Human)
Description:
O95342
Residue:
1321
  
Inhibitor
Name:
BDBM50248151
Synonyms:
CHEBI:76163 Maxicam | W-8495
Type:
Small organic molecule
Emp. Form.:
C14H13N3O5S
Mol. Mass.:
335.335
SMILES:
CN1C(C(=O)Nc2cc(C)on2)=C(O)c2ccccc2S1(=O)=O
: