Target
ATP-binding cassette sub-family C member 4
Ligand
BDBM50248241
Substrate
Meas. Tech.
ChEMBL_1678647 (CHEMBL4028924)
IC50
>133000±n/a nM
Citation
 Morgan, REvan Staden, CJChen, YKalyanaraman, NKalanzi, JDunn, RTAfshari, CAHamadeh, HK A multifactorial approach to hepatobiliary transporter assessment enables improved therapeutic compound development. Toxicol Sci 136:216-41 (2013)  
Target
Name:
ATP-binding cassette sub-family C member 4
Synonyms:
ABCC4 MOAT-B MRP/cMOAT-related ABC transporter MRP4_HUMAN Multidrug resistance-associated protein 4
Type:
PROTEIN
Mol. Mass.:
149546.12
Organism:
Homo sapiens (Human)
Description:
ChEMBL_1486828
Residue:
1325
  
Inhibitor
Name:
BDBM50248241
Synonyms:
CHEBI:31387 Cetrorelix Acetate D-20761 SB-075 Acetate
Type:
Small organic molecule
Emp. Form.:
C72H96ClN17O16
Mol. Mass.:
1491.09
SMILES:
CC(O)=O.CC(C)C[C@H](NC(=O)[C@@H](CCCNC(N)=O)NC(=O)[C@H](Cc1ccc(O)cc1)NC(=O)[C@H](CO)NC(=O)[C@@H](Cc1cccnc1)NC(=O)[C@@H](Cc1ccc(Cl)cc1)NC(=O)[C@@H](Cc1ccc2ccccc2c1)NC(C)=O)C(=O)N[C@@H](CCCNC(N)=N)C(=O)N1CCC[C@H]1C(=O)N[C@H](C)C(N)=O
: