Target
Bile salt export pump
Ligand
BDBM50018518
Substrate
Meas. Tech.
ChEMBL_1678644 (CHEMBL4028921)
IC50
>133000±n/a nM
Citation
 Morgan, REvan Staden, CJChen, YKalyanaraman, NKalanzi, JDunn, RTAfshari, CAHamadeh, HK A multifactorial approach to hepatobiliary transporter assessment enables improved therapeutic compound development. Toxicol Sci 136:216-41 (2013)  
Target
Name:
Bile salt export pump
Synonyms:
ABCB11 ATP-binding cassette sub-family B member 11 Bile Salt Export Pump, BSEP Bile salt export pump (BSEP)
Type:
Protein
Mol. Mass.:
146405.49
Organism:
Homo sapiens (Human)
Description:
O95342
Residue:
1321
  
Inhibitor
Name:
BDBM50018518
Synonyms:
((E)-6,6-Dimethyl-hept-2-en-4-ynyl)-methyl-naphthalen-1-ylmethyl-amine (6,6-Dimethyl-hept-2-en-4-ynyl)-methyl-naphthalen-1-ylmethyl-amine(Terbinafine) 1N,6,6-trimethyl-1N-(1-naphthylmethyl)-(E)-2-hepten-4-yn-1-amine Lamisil N,6,6-trimethyl-N-(naphthalen-1-ylmethyl)hept-2-en-4-yn-1-amine SF-86-327 Terbinafin cid_1549008
Type:
Small organic molecule
Emp. Form.:
C21H25N
Mol. Mass.:
291.4299
SMILES:
CN(C\C=C\C#CC(C)(C)C)Cc1cccc2ccccc12
: