Target
Endothelin-1 receptor
Ligand
BDBM50329842
Substrate
Meas. Tech.
ChEBML_1680040
IC50
24±n/a nM
Citation
 Khadtare, NStephani, RKorlipara, V Design, synthesis and evaluation of 1,3,6-trisubstituted-4-oxo-1,4-dihydroquinoline-2-carboxylic acid derivatives as ET Bioorg Med Chem Lett 27:2281-2285 (2017)  
Target
Name:
Endothelin-1 receptor
Synonyms:
EDNRA ET-A ETA-R Endothelin receptor type A hET-AR
Type:
Enzyme Catalytic Domain
Mol. Mass.:
48736.88
Organism:
Homo sapiens (Human)
Description:
P25101
Residue:
427
  
Inhibitor
Name:
BDBM50329842
Synonyms:
3-(3-Carboxybenzyl)-1-[(6-ethylbenzo[d][1,3]dioxol-5-yl)methyl]-6-(methoxymethoxy)-4-oxo-1,4-dihydroquinoline-2-carboxylic acid | CHEMBL1271531
Type:
Small organic molecule
Emp. Form.:
C30H27NO9
Mol. Mass.:
545.5367
SMILES:
CCc1cc2OCOc2cc1Cn1c(C(O)=O)c(Cc2cccc(c2)C(O)=O)c(=O)c2cc(OCOC)ccc12
: