Target
Endothelin-1 receptor
Ligand
BDBM50249531
Substrate
Meas. Tech.
ChEBML_1680040
IC50
6.2±n/a nM
Citation
 Khadtare, NStephani, RKorlipara, V Design, synthesis and evaluation of 1,3,6-trisubstituted-4-oxo-1,4-dihydroquinoline-2-carboxylic acid derivatives as ET Bioorg Med Chem Lett 27:2281-2285 (2017)  
Target
Name:
Endothelin-1 receptor
Synonyms:
EDNRA ET-A ETA-R Endothelin receptor type A hET-AR
Type:
Enzyme Catalytic Domain
Mol. Mass.:
48736.88
Organism:
Homo sapiens (Human)
Description:
P25101
Residue:
427
  
Inhibitor
Name:
BDBM50249531
Synonyms:
CHEMBL4081426
Type:
Small organic molecule
Emp. Form.:
C32H31N5O6
Mol. Mass.:
581.6184
SMILES:
CCc1cc2OCOc2cc1Cn1c(C(O)=O)c(Cc2cccc(c2)-c2nnn[nH]2)c(=O)c2cc(OCC(C)C)ccc12
: