Target
Malate dehydrogenase, cytoplasmic
Ligand
BDBM50250237
Substrate
Meas. Tech.
ChEBML_1681382
IC50
>40000±n/a nM
Citation
 Naik, RBan, HSJang, KKim, IXu, XHarmalkar, DShin, SAKim, MKim, BKPark, JKu, BOh, SWon, MLee, K Methyl 3-(3-(4-(2,4,4-Trimethylpentan-2-yl)phenoxy)-propanamido)benzoate as a Novel and Dual Malate Dehydrogenase (MDH) 1/2 Inhibitor Targeting Cancer Metabolism. J Med Chem 60:8631-8646 (2017)  
Target
Name:
Malate dehydrogenase, cytoplasmic
Synonyms:
Cytosolic malate dehydrogenase MDHA Malate dehydrogenase cytoplasmic | Malate dehydrogenase, cytoplasmic
Type:
PROTEIN
Mol. Mass.:
36427.72
Organism:
Homo sapiens (Human)
Description:
ChEMBL_1456624
Residue:
334
  
Inhibitor
Name:
BDBM50250237
Synonyms:
CHEMBL4067849
Type:
Small organic molecule
Emp. Form.:
C21H23NO4
Mol. Mass.:
353.4116
SMILES:
COC(=O)c1cccc(NC(=O)COc2ccc(cc2)C2CCCC2)c1
: