Target
Ornithine decarboxylase
Ligand
BDBM50005726
Substrate
Meas. Tech.
ChEBML_148124
IC50
14±n/a nM
Citation
 Stanek, JFrei, JMett, HSchneider, PRegenass, U 2-substituted 3-(aminooxy)propanamines as inhibitors of ornithine decarboxylase: synthesis and biological activity. J Med Chem 35:1339-44 (1992)  
Target
Name:
Ornithine decarboxylase
Synonyms:
DCOR_RAT Odc1
Type:
PROTEIN
Mol. Mass.:
51037.04
Organism:
Rattus norvegicus
Description:
ChEMBL_1344641
Residue:
461
  
Inhibitor
Name:
BDBM50005726
Synonyms:
CHEMBL27061 | O-(3-Amino-2-fluoro-propyl)-hydroxylamine
Type:
Small organic molecule
Emp. Form.:
C3H9FN2O
Mol. Mass.:
108.1148
SMILES:
NCC(F)CON
: