Target
Atypical chemokine receptor 3
Ligand
BDBM50250373
Substrate
Meas. Tech.
ChEBML_1681651
Ki
32±n/a nM
Citation
 Boehm, MBeaumont, KJones, RKalgutkar, ASZhang, LAtkinson, KBai, GBrown, JAEng, HGoetz, GHHolder, BRKhunte, BLazzaro, SLimberakis, CRyu, SShapiro, MJTylaska, LYan, JTurner, RLeung, SSFRamaseshan, MPrice, DALiras, SJacobson, MPEarp, DJLokey, RSMathiowetz, AMMenhaji-Klotz, E Discovery of Potent and Orally Bioavailable Macrocyclic Peptide-Peptoid Hybrid CXCR7 Modulators. J Med Chem 60:9653-9663 (2017)  
Target
Name:
Atypical chemokine receptor 3
Synonyms:
ACKR3 C-X-C chemokine receptor type 7 CMKOR1 CXCR-7 Chemokine orphan receptor 1 G-protein coupled receptor RDC1 homolog RDC-1 | RDC1
Type:
Enzyme
Mol. Mass.:
41498.84
Organism:
Homo sapiens (Human)
Description:
P25106
Residue:
362
  
Inhibitor
Name:
BDBM50250373
Synonyms:
CHEMBL4089847
Type:
Small organic molecule
Emp. Form.:
C47H61F2N7O6S
Mol. Mass.:
890.092
SMILES:
CC(C)(C)C[C@@H]1NC(=O)[C@@H](Cc2ccccc2)NC(=O)[C@H](CC2CCCCC2)NC(=O)CN(CCCc2ccc(F)cc2F)C(=O)[C@H]2CCCN2C(=O)[C@H](Cc2cscn2)NC1=O
: