Target
L-lactate dehydrogenase A chain
Ligand
BDBM50103568
Substrate
Meas. Tech.
ChEMBL_1682048 (CHEMBL4032325)
Kd
59±n/a nM
Citation
 Rai, GBrimacombe, KRMott, BTUrban, DJHu, XYang, SMLee, TDCheff, DMKouznetsova, JBenavides, GAPohida, KKuenstner, EJLuci, DKLukacs, CMDavies, DRDranow, DMZhu, HSulikowski, GMoore, WJStott, GMFlint, AJHall, MDDarley-Usmar, VMNeckers, LMDang, CVWaterson, AGSimeonov, AJadhav, AMaloney, DJ Discovery and Optimization of Potent, Cell-Active Pyrazole-Based Inhibitors of Lactate Dehydrogenase (LDH). J Med Chem 60:9184-9204 (2017)  
Target
Name:
L-lactate dehydrogenase A chain
Synonyms:
Cell proliferation-inducing gene 19 protein L-lactate dehydrogenase A Chain LDH-A LDHA Lactate dehydrogenase A (LDHA) | Renal carcinoma antigen NY-REN-59
Type:
Protein
Mol. Mass.:
36694.85
Organism:
Homo sapiens (Human)
Description:
P00338::PDB Code: 4ajp
Residue:
332
  
Inhibitor
Name:
BDBM50103568
Synonyms:
CHEMBL3335794
Type:
Small organic molecule
Emp. Form.:
C31H25F2N5O7S
Mol. Mass.:
649.621
SMILES:
COc1ncc(-c2ccc3c(Nc4cc(Oc5cc(F)cc(F)c5)cc(c4)C(O)=O)c(cnc3c2)S(=O)(=O)NC2CC2)c(OC)n1
: