Target
Tyrosine-protein kinase JAK1
Ligand
BDBM147735
Substrate
Meas. Tech.
ChEMBL_1682726 (CHEMBL4033003)
IC50
0.300000±n/a nM
Citation
 Siu, TBrubaker, JFuller, PTorres, LZeng, HClose, JMampreian, DMShi, FLiu, DFradera, XJohnson, KBays, NKadic, EHe, FGoldenblatt, PShaffer, LPatel, SBLesburg, CAAlpert, CDorosh, LDeshmukh, SVYu, HKlappenbach, JElwood, FDinsmore, CJFernandez, RMoy, LYoung, JR The Discovery of 3-((4-Chloro-3-methoxyphenyl)amino)-1-((3R,4S)-4-cyanotetrahydro-2H-pyran-3-yl)-1H-pyrazole-4-carboxamide, a Highly Ligand Efficient and Efficacious Janus Kinase 1 Selective Inhibitor with Favorable Pharmacokinetic Properties. J Med Chem 60:9676-9690 (2017)  
Target
Name:
Tyrosine-protein kinase JAK1
Synonyms:
JAK-1 JAK1A JAK1_HUMAN Janus kinase 1 (JAK1) | Janus kinase 1 JAK1
Type:
Protein
Mol. Mass.:
133293.73
Organism:
Homo sapiens (Human)
Description:
P23458
Residue:
1154
  
Inhibitor
Name:
BDBM147735
Synonyms:
US8962608, 28-47
Type:
Small organic molecule
Emp. Form.:
C22H25F3N6O2
Mol. Mass.:
462.4681
SMILES:
NC(=O)c1cn(nc1Nc1ccc(cc1)[C@H](O)C(F)(F)F)[C@H]1CC[C@@H](C[C@@H]1C#N)N1CCC1
: