Target
Carbonic anhydrase 9
Ligand
BDBM50251369
Substrate
Meas. Tech.
ChEBML_1683729
Ki
0.500000±n/a nM
Citation
 Akocak, SLolak, NNocentini, AKarakoc, GTufan, ASupuran, CT Synthesis and biological evaluation of novel aromatic and heterocyclic bis-sulfonamide Schiff bases as carbonic anhydrase I, II, VII and IX inhibitors. Bioorg Med Chem 25:3093-3097 (2017)  
Target
Name:
Carbonic anhydrase 9
Synonyms:
CA-IX CAH9_HUMAN Carbonic anhydrase 9 (CA IX) Carbonic anhydrase 9 precursor Carbonic anhydrase IX (CAIX) Carbonic anhydrases; II & IX MN RCC-associated antigen G250
Type:
Enzyme
Mol. Mass.:
49669.03
Organism:
Homo sapiens (Human)
Description:
Catalytic domain of human cloned isozyme was used in the assay
Residue:
459
  
Inhibitor
Name:
BDBM50251369
Synonyms:
CHEMBL4084006
Type:
Small organic molecule
Emp. Form.:
C12H10N8O4S4
Mol. Mass.:
458.519
SMILES:
NS(=O)(=O)c1nnc(\N=C\c2cccc(\C=N\c3nnc(s3)S(N)(=O)=O)c2)s1
: