Target
Calcium/calmodulin-dependent protein kinase type 1
Ligand
BDBM50252338
Substrate
Meas. Tech.
ChEBML_1684619
IC50
6900±n/a nM
Citation
 Zhou, DSpringer, MZXu, DLiu, DHudmon, AMacleod, KFMeroueh, SO Small molecules inhibit STAT3 activation, autophagy, and cancer cell anchorage-independent growth. Bioorg Med Chem 25:2995-3005 (2017)  
Target
Name:
Calcium/calmodulin-dependent protein kinase type 1
Synonyms:
CAMK1 CaM kinase I alpha CaMKI-alpha KCC1A_HUMAN
Type:
PROTEIN
Mol. Mass.:
41325.04
Organism:
Homo sapiens (Human)
Description:
ChEMBL_655701
Residue:
370
  
Inhibitor
Name:
BDBM50252338
Synonyms:
CHEMBL4090364
Type:
Small organic molecule
Emp. Form.:
C25H30Cl3N5
Mol. Mass.:
506.898
SMILES:
CCN(CC)CCCC(C)Nc1nc(\C=C\c2c(Cl)cc(Cl)cc2Cl)nc2ccc(N)cc12
: