Target
Gastrin/cholecystokinin type B receptor
Ligand
BDBM50006837
Substrate
Meas. Tech.
ChEBML_48261
IC50
670.0±n/a nM
Citation
 Yu, MJMcCowan, JRMason, NRDeeter, JBMendelsohn, LG Synthesis and X-ray crystallographic analysis of quinazolinone cholecystokinin/gastrin receptor ligands. J Med Chem 35:2534-42 (1992)  
Target
Name:
Gastrin/cholecystokinin type B receptor
Synonyms:
Cckbr Cholecystokinin receptor Gastrin/cholecystokinin type B receptor
Type:
Enzyme Catalytic Domain
Mol. Mass.:
49196.59
Organism:
MOUSE
Description:
Cholecystokinin A CCKBR MOUSE::P56481
Residue:
453
  
Inhibitor
Name:
BDBM50006837
Synonyms:
2-[2-(1H-Indol-3-yl)-ethyl]-3-phenyl-3H-quinazolin-4-one | CHEMBL37653
Type:
Small organic molecule
Emp. Form.:
C24H19N3O
Mol. Mass.:
365.4272
SMILES:
O=c1n(c(CCc2c[nH]c3ccccc23)nc2ccccc12)-c1ccccc1
: