Target
Cytochrome P450 1B1
Ligand
BDBM7458
Substrate
Meas. Tech.
ChEMBL_1684850 (CHEMBL4035329)
IC50
360±n/a nM
Citation
 Dutour, RPoirier, D Inhibitors of cytochrome P450 (CYP) 1B1. Eur J Med Chem 135:296-306 (2017)  
Target
Name:
Cytochrome P450 1B1
Synonyms:
CP1B1_HUMAN CYPIB1 | Cytochrome P450 1B1 (CYP1B1)
Type:
PROTEIN
Mol. Mass.:
60861.81
Organism:
Homo sapiens (Human)
Description:
ChEMBL_1474523
Residue:
543
  
Inhibitor
Name:
BDBM7458
Synonyms:
5,7-dihydroxy-2-(4-hydroxyphenyl)-4H-chromen-4-one Apigenin Apigenin (3) Apigenin, 13 Naringenin, 18 US11337935, Compound Apigenin cid_5280443 | jm5b01461, Compound 90
Type:
Small organic molecule
Emp. Form.:
C15H10O5
Mol. Mass.:
270.2369
SMILES:
Oc1ccc(cc1)-c1cc(=O)c2c(O)cc(O)cc2o1
: