Target
Cytochrome P450 1A1
Ligand
BDBM50241084
Substrate
Meas. Tech.
ChEMBL_1684851 (CHEMBL4035330)
IC50
95±n/a nM
Citation
 Dutour, RPoirier, D Inhibitors of cytochrome P450 (CYP) 1B1. Eur J Med Chem 135:296-306 (2017)  
Target
Name:
Cytochrome P450 1A1
Synonyms:
CP1A1_HUMAN CYPIA1 Cytochrome P450 1A1 P450 form 6 P450-P1
Type:
Protein
Mol. Mass.:
58177.23
Organism:
Homo sapiens (Human)
Description:
P04798
Residue:
512
  
Inhibitor
Name:
BDBM50241084
Synonyms:
3'-Methoxyapigenin 5,7-dihydroxy-2-(4-hydroxy-3-methoxyphenyl)-4-benzopyrone 5,7-dihydroxy-2-(4-hydroxy-3-methoxyphenyl)-4H-chromen-4-one Chryseriol Chrysoeriol (26) cid_5280666
Type:
Small organic molecule
Emp. Form.:
C16H12O6
Mol. Mass.:
300.2629
SMILES:
COc1cc(ccc1O)-c1cc(=O)c2c(O)cc(O)cc2o1
: