Target
Kappa-type opioid receptor
Ligand
BDBM50453088
Substrate
Meas. Tech.
ChEBML_145222
Ki
0.510000±n/a nM
Citation
 Vecchietti, VClarke, GDColle, RGiardina, GPetrone, GSbacchi, M (1S)-1-(aminomethyl)-2-(arylacetyl)-1,2,3,4-tetrahydroisoquinoline and heterocycle-condensed tetrahydropyridine derivatives: members of a novel class of very potent kappa opioid analgesics. J Med Chem 34:2624-33 (1991)  
Target
Name:
Kappa-type opioid receptor
Synonyms:
Kappa Opioid Receptor OPRK1 Opiate Kappa 1 | mu/kappa opioid receptor
Type:
G Protein-Coupled Receptor (GPCR)
Mol. Mass.:
42744.99
Organism:
Cavia porcellus (domestic guinea pig)
Description:
P41144
Residue:
380
  
Inhibitor
Name:
BDBM50453088
Synonyms:
CHEMBL2114226
Type:
Small organic molecule
Emp. Form.:
C26H34Cl2N2O8
Mol. Mass.:
573.463
SMILES:
CCO.OC(C(O)C(O)=O)C(O)=O.CN(C)CC1N(CCc2ccccc12)C(=O)Cc1ccc(Cl)c(Cl)c1
: