Target
Atrial natriuretic peptide receptor 3
Ligand
BDBM50254085
Substrate
Meas. Tech.
ChEBML_1686038
IC50
54±n/a nM
Citation
 Nishizawa, NNakamura, GNoguchi, YNakagawa, HShimizu, ANakayama, MTakekawa, SAsami, T A potent and selective natriuretic peptide receptor-3 blocker 11-mer peptide created by hybridization of musclin and atrial natriuretic peptide. Bioorg Med Chem Lett 27:3542-3545 (2017)  
Target
Name:
Atrial natriuretic peptide receptor 3
Synonyms:
ANP-C ANPRC Atrial natriuretic peptide C-type receptor Atrial natriuretic peptide receptor C5orf23 NPR3 | NPRC
Type:
PROTEIN
Mol. Mass.:
59805.12
Organism:
Homo sapiens (Human)
Description:
ChEMBL_34991
Residue:
541
  
Inhibitor
Name:
BDBM50254085
Synonyms:
CHEMBL4097040
Type:
Small organic molecule
Emp. Form.:
C45H80N16O12
Mol. Mass.:
1037.2167
SMILES:
CC[C@H](C)[C@H](NC(=O)[C@H](CCCNC(N)=N)NC(=O)[C@H](CC(O)=O)NC(=O)[C@@H](NC(=O)[C@H](CCCNC(N)=N)NC(=O)CNC(=O)CNC(=O)[C@H](CC1CCCCC1)NC(C)=O)[C@@H](C)CC)C(=O)NCC(N)=O
: