Target
Sigma non-opioid intracellular receptor 1
Ligand
BDBM50007674
Substrate
Meas. Tech.
ChEBML_226567
IC50
3.9±n/a nM
Citation
 Chenard, BLShalaby, IAKoe, BKRonau, RTButler, TWProchniak, MASchmidt, AWFox, CB Separation of alpha 1 adrenergic and N-methyl-D-aspartate antagonist activity in a series of ifenprodil compounds. J Med Chem 34:3085-90 (1991)  
Target
Name:
Sigma non-opioid intracellular receptor 1
Synonyms:
Aging-associated gene 8 protein SGMR1_HUMAN SIGMAR1 SR31747-binding protein Sigma 1-type opioid receptor Sigma1R | hSigmaR1
Type:
Enzyme Catalytic Domain
Mol. Mass.:
25124.85
Organism:
Homo sapiens (Human)
Description:
Q99720
Residue:
223
  
Inhibitor
Name:
BDBM50007674
Synonyms:
(+)-erythro 4-[2-(4-Benzyl-piperidin-1-yl)-1-hydroxy-propyl]-phenol 4-[(1R,2S)-2-(4-Benzyl-piperidin-1-yl)-1-hydroxy-propyl]-phenol 4-[2-(4-Benzyl-piperidin-1-yl)-1-hydroxy-propyl]-phenol Ifenprodil | Ifenprodil,(+/-)
Type:
Small organic molecule
Emp. Form.:
C21H27NO2
Mol. Mass.:
325.4446
SMILES:
C[C@@H]([C@H](O)c1ccc(O)cc1)N1CCC(Cc2ccccc2)CC1
: