Target
Metabotropic glutamate receptor 8
Ligand
BDBM50314793
Substrate
Meas. Tech.
ChEBML_1687020
EC50
7800±n/a nM
Citation
 Selvam, CLemasson, IABrabet, IOueslati, NKaraman, BCabaye, ATora, ASCommare, BCourtiol, TCesarini, SMcCort-Tranchepain, IRigault, DMony, LBessiron, TMcLean, HLeroux, FRColobert, FDaniel, HGoupil-Lamy, ABertrand, HOGoudet, CPin, JPAcher, FC Increased Potency and Selectivity for Group III Metabotropic Glutamate Receptor Agonists Binding at Dual sites. J Med Chem 61:1969-1989 (2018)  
Target
Name:
Metabotropic glutamate receptor 8
Synonyms:
GPRC1H GRM8_HUMAN Metabotropic glutamate receptor 8 | metabotropic glutamate 8
Type:
Enzyme Catalytic Domain
Mol. Mass.:
101759.58
Organism:
Homo sapiens (Human)
Description:
metabotropic glutamate 8 GRM8 HUMAN::O00222
Residue:
908
  
Inhibitor
Name:
BDBM50314793
Synonyms:
(S)-3-amino-3-carboxypropyl-2'-carboxyethyl phosphinic acid | CHEMBL1089515
Type:
Small organic molecule
Emp. Form.:
C7H14NO6P
Mol. Mass.:
239.1629
SMILES:
N[C@@H](CCP(O)(=O)CCC(O)=O)C(O)=O
: