Target
Metabotropic glutamate receptor 6
Ligand
BDBM50314793
Substrate
Meas. Tech.
ChEMBL_1687017 (CHEMBL4037496)
EC50
31000±n/a nM
Citation
 Selvam, CLemasson, IABrabet, IOueslati, NKaraman, BCabaye, ATora, ASCommare, BCourtiol, TCesarini, SMcCort-Tranchepain, IRigault, DMony, LBessiron, TMcLean, HLeroux, FRColobert, FDaniel, HGoupil-Lamy, ABertrand, HOGoudet, CPin, JPAcher, FC Increased Potency and Selectivity for Group III Metabotropic Glutamate Receptor Agonists Binding at Dual sites. J Med Chem 61:1969-1989 (2018)  
Target
Name:
Metabotropic glutamate receptor 6
Synonyms:
GPRC1F GRM6_HUMAN Metabotropic glutamate receptor 6 metabotropic glutamate 6
Type:
Enzyme Catalytic Domain
Mol. Mass.:
95479.26
Organism:
Homo sapiens (Human)
Description:
metabotropic glutamate 6 GRM6 HUMAN::O15303
Residue:
877
  
Inhibitor
Name:
BDBM50314793
Synonyms:
(S)-3-amino-3-carboxypropyl-2'-carboxyethyl phosphinic acid | CHEMBL1089515
Type:
Small organic molecule
Emp. Form.:
C7H14NO6P
Mol. Mass.:
239.1629
SMILES:
N[C@@H](CCP(O)(=O)CCC(O)=O)C(O)=O
: