Target
Apelin receptor
Ligand
BDBM50014619
Substrate
Meas. Tech.
ChEBML_1689663
Ki
0.300000±n/a nM
Citation
 McKinnie, SMKWang, WFischer, CMcDonald, TKalin, KRIturrioz, XLlorens-Cortes, COudit, GYVederas, JC Synthetic Modification within the"RPRL" Region of Apelin Peptides: Impact on Cardiovascular Activity and Stability to Neprilysin and Plasma Degradation. J Med Chem 60:6408-6427 (2017)  
Target
Name:
Apelin receptor
Synonyms:
APJ_RAT Angiotensin receptor-like 1 Apj B78 GPCR34
Type:
PROTEIN
Mol. Mass.:
42351.61
Organism:
Rattus norvegicus
Description:
ChEMBL_10710
Residue:
377
  
Inhibitor
Name:
BDBM50014619
Synonyms:
CHEMBL3184840
Type:
Small organic molecule
Emp. Form.:
C69H108N22O16S
Mol. Mass.:
1533.799
SMILES:
CSCC[C@H](NC(=O)[C@@H]1CCCN1C(=O)CNC(=O)[C@H](CCCCN)NC(=O)[C@H](Cc1cnc[nH]1)NC(=O)[C@H](CO)NC(=O)[C@H](CC(C)C)NC(=O)[C@H](CCCNC(N)=N)NC(=O)[C@@H]1CCCN1C(=O)[C@H](CCCNC(N)=N)NC(=O)[C@@H]1CCC(=O)N1)C(=O)N1CCC[C@H]1C(=O)N[C@@H](Cc1ccccc1)C(O)=O
: