Target
Kappa-type opioid receptor
Ligand
BDBM50257764
Substrate
Meas. Tech.
ChEBML_1689990
IC50
1800±n/a nM
Citation
 Ravilla, LVenkata Subba Naidu, NDogra, SUmrao, DYadav, PNBiswas, AMichael, DSekar, KNagarajan, K Opioid Receptor Modulators with a Cinnamyl Group. J Med Chem 60:6733-6750 (2017)  
Target
Name:
Kappa-type opioid receptor
Synonyms:
K-OR-1 Kappa-opioid receptor (KOR) Kappa-type opioid receptor (KOR) OPIATE Kappa OPRK1 kappa opioid receptor (KOR)
Type:
G Protein-Coupled Receptor (GPCR)
Mol. Mass.:
42648.76
Organism:
Homo sapiens (Human)
Description:
P41145
Residue:
380
  
Inhibitor
Name:
BDBM50257764
Synonyms:
CHEMBL4061439
Type:
Small organic molecule
Emp. Form.:
C28H34N4O3S
Mol. Mass.:
506.66
SMILES:
CCOC(=O)C(NC(=O)C(\CN1CCN(CC1)c1nsc2ccccc12)=C\c1ccccc1)C(C)C
: