Target
Mu-type opioid receptor
Ligand
BDBM50257769
Substrate
Meas. Tech.
ChEBML_1689996
IC50
18.0±n/a nM
Citation
 Ravilla, LVenkata Subba Naidu, NDogra, SUmrao, DYadav, PNBiswas, AMichael, DSekar, KNagarajan, K Opioid Receptor Modulators with a Cinnamyl Group. J Med Chem 60:6733-6750 (2017)  
Target
Name:
Mu-type opioid receptor
Synonyms:
M-OR-1 MOR-1 MUOR1 Mu opiate receptor OPRM1 hMOP | mu-type opioid receptor isoform MOR-1
Type:
G Protein-Coupled Receptor (GPCR)
Mol. Mass.:
44789.51
Organism:
Homo sapiens (Human)
Description:
P35372
Residue:
400
  
Inhibitor
Name:
BDBM50257769
Synonyms:
CHEMBL4100902
Type:
Small organic molecule
Emp. Form.:
C22H25NO3
Mol. Mass.:
351.4388
SMILES:
CC1(CCN(C\C(=C/c2ccccc2)C(O)=O)CC1)c1cccc(O)c1
: