Target
Kappa-type opioid receptor
Ligand
BDBM50257765
Substrate
Meas. Tech.
ChEMBL_1689990 (CHEMBL4040560)
IC50
948±n/a nM
Citation
 Ravilla, LVenkata Subba Naidu, NDogra, SUmrao, DYadav, PNBiswas, AMichael, DSekar, KNagarajan, K Opioid Receptor Modulators with a Cinnamyl Group. J Med Chem 60:6733-6750 (2017)  
Target
Name:
Kappa-type opioid receptor
Synonyms:
K-OR-1 Kappa-opioid receptor (KOR) Kappa-type opioid receptor (KOR) OPIATE Kappa OPRK1 kappa opioid receptor (KOR)
Type:
G Protein-Coupled Receptor (GPCR)
Mol. Mass.:
42648.76
Organism:
Homo sapiens (Human)
Description:
P41145
Residue:
380
  
Inhibitor
Name:
BDBM50257765
Synonyms:
CHEMBL4067441
Type:
Small organic molecule
Emp. Form.:
C25H30ClN3O3
Mol. Mass.:
455.977
SMILES:
CC(C)C(NC(=O)C(\CN1CCN(CC1)c1ccc(Cl)cc1)=C\c1ccccc1)C(O)=O
: