Target
cGMP-dependent 3',5'-cyclic phosphodiesterase
Ligand
BDBM50258265
Substrate
Meas. Tech.
ChEBML_1690400
IC50
6100±n/a nM
Citation
 Mikami, SSasaki, SAsano, YUjikawa, OFukumoto, SNakashima, KOki, HKamiguchi, NImada, HIwashita, HTaniguchi, T Discovery of an Orally Bioavailable, Brain-Penetrating, in Vivo Active Phosphodiesterase 2A Inhibitor Lead Series for the Treatment of Cognitive Disorders. J Med Chem 60:7658-7676 (2017)  
Target
Name:
cGMP-dependent 3',5'-cyclic phosphodiesterase
Synonyms:
CGS-PDE Homo sapiens phosphodiesterase 2A (PDE2A) PDE2A cGSPDE
Type:
Enzyme Catalytic Domain
Mol. Mass.:
105691.58
Organism:
Homo sapiens (Human)
Description:
O00408
Residue:
941
  
Inhibitor
Name:
BDBM50258265
Synonyms:
CHEMBL4068494
Type:
Small organic molecule
Emp. Form.:
C16H13F3N4O2
Mol. Mass.:
350.2952
SMILES:
Cc1cnc2c(cnn2c1)C(=O)NCc1ccc(OC(F)(F)F)cc1
: