Target
cGMP-inhibited 3',5'-cyclic phosphodiesterase 3A
Ligand
BDBM50258268
Substrate
Meas. Tech.
ChEBML_1690358
IC50
4200±n/a nM
Citation
 Mikami, SSasaki, SAsano, YUjikawa, OFukumoto, SNakashima, KOki, HKamiguchi, NImada, HIwashita, HTaniguchi, T Discovery of an Orally Bioavailable, Brain-Penetrating, in Vivo Active Phosphodiesterase 2A Inhibitor Lead Series for the Treatment of Cognitive Disorders. J Med Chem 60:7658-7676 (2017)  
Target
Name:
cGMP-inhibited 3',5'-cyclic phosphodiesterase 3A
Synonyms:
3',5'-cyclic phosphodiesterase Cyclic GMP-inhibited phosphodiesterase A PDE3A_HUMAN Phosphodiesterase 3 (PDE3) Phosphodiesterase 3A Phosphodiesterase 3A (PDE3A1) cGMP-inhibited 3',5'-cyclic phosphodiesterase A | cGMP-inhibited 3,5-cyclic phosphodiesterase A
Type:
Enzyme
Mol. Mass.:
124966.46
Organism:
Homo sapiens (Human)
Description:
Q14432
Residue:
1141
  
Inhibitor
Name:
BDBM50258268
Synonyms:
CHEMBL4059831 | US11419874, Example 21
Type:
Small organic molecule
Emp. Form.:
C18H17F3N4O2
Mol. Mass.:
378.3484
SMILES:
CC[C@@H](NC(=O)c1cnn2cc(C)cnc12)c1ccc(OC(F)(F)F)cc1
: