Target
Rod cGMP-specific 3',5'-cyclic phosphodiesterase subunit alpha/beta
Ligand
BDBM50258268
Substrate
Meas. Tech.
ChEMBL_1690362 (CHEMBL4040932)
IC50
>10000±n/a nM
Citation
 Mikami, SSasaki, SAsano, YUjikawa, OFukumoto, SNakashima, KOki, HKamiguchi, NImada, HIwashita, HTaniguchi, T Discovery of an Orally Bioavailable, Brain-Penetrating, in Vivo Active Phosphodiesterase 2A Inhibitor Lead Series for the Treatment of Cognitive Disorders. J Med Chem 60:7658-7676 (2017)  
Target
Name:
Rod cGMP-specific 3',5'-cyclic phosphodiesterase subunit alpha/beta
Synonyms:
PDE 6AB Rod cGMP-specific 3'''''''',5''''''''-cyclic phosphodiesterase alpha/beta Rod cGMP-specific 3'',5''-cyclic phosphodiesterase alpha/beta | Rod cGMP-specific 3',5'-cyclic phosphodiesterase alpha/beta
Type:
Protein
Mol. Mass.:
Description:
Components:
This complex has 2 components.
Component 1
Name:
Rod cGMP-specific 3',5'-cyclic phosphodiesterase subunit alpha
Synonyms:
PDE6A PDEA | Rod cGMP-specific 3',5'-cyclic phosphodiesterase alpha
Type:
PROTEIN
Mol. Mass.:
99531.10
Organism:
Homo sapiens (Human)
Description:
ChEMBL_1347866
Residue:
860
  
Component 2
Name:
Rod cGMP-specific 3',5'-cyclic phosphodiesterase subunit beta
Synonyms:
GMP-PDE beta PDE6B_HUMAN | PDEB
Type:
PROTEIN
Mol. Mass.:
98308.48
Organism:
Homo sapiens (Human)
Description:
ChEMBL_105761
Residue:
854
  
Inhibitor
Name:
BDBM50258268
Synonyms:
CHEMBL4059831 | US11419874, Example 21
Type:
Small organic molecule
Emp. Form.:
C18H17F3N4O2
Mol. Mass.:
378.3484
SMILES:
CC[C@@H](NC(=O)c1cnn2cc(C)cnc12)c1ccc(OC(F)(F)F)cc1
: