Target
cGMP-dependent 3',5'-cyclic phosphodiesterase
Ligand
BDBM50258300
Substrate
Meas. Tech.
ChEBML_1690400
IC50
16000±n/a nM
Citation
 Mikami, SSasaki, SAsano, YUjikawa, OFukumoto, SNakashima, KOki, HKamiguchi, NImada, HIwashita, HTaniguchi, T Discovery of an Orally Bioavailable, Brain-Penetrating, in Vivo Active Phosphodiesterase 2A Inhibitor Lead Series for the Treatment of Cognitive Disorders. J Med Chem 60:7658-7676 (2017)  
Target
Name:
cGMP-dependent 3',5'-cyclic phosphodiesterase
Synonyms:
CGS-PDE Homo sapiens phosphodiesterase 2A (PDE2A) PDE2A cGSPDE
Type:
Enzyme Catalytic Domain
Mol. Mass.:
105691.58
Organism:
Homo sapiens (Human)
Description:
O00408
Residue:
941
  
Inhibitor
Name:
BDBM50258300
Synonyms:
CHEMBL4066865
Type:
Small organic molecule
Emp. Form.:
C18H20N4O2
Mol. Mass.:
324.377
SMILES:
CCC(NC(=O)c1c(C)nn2cccnc12)c1ccc(OC)cc1
: