Target
cGMP-dependent 3',5'-cyclic phosphodiesterase
Ligand
BDBM50258308
Substrate
Meas. Tech.
ChEBML_1690400
IC50
28000±n/a nM
Citation
 Mikami, SSasaki, SAsano, YUjikawa, OFukumoto, SNakashima, KOki, HKamiguchi, NImada, HIwashita, HTaniguchi, T Discovery of an Orally Bioavailable, Brain-Penetrating, in Vivo Active Phosphodiesterase 2A Inhibitor Lead Series for the Treatment of Cognitive Disorders. J Med Chem 60:7658-7676 (2017)  
Target
Name:
cGMP-dependent 3',5'-cyclic phosphodiesterase
Synonyms:
CGS-PDE Homo sapiens phosphodiesterase 2A (PDE2A) PDE2A cGSPDE
Type:
Enzyme Catalytic Domain
Mol. Mass.:
105691.58
Organism:
Homo sapiens (Human)
Description:
O00408
Residue:
941
  
Inhibitor
Name:
BDBM50258308
Synonyms:
CHEMBL4101192
Type:
Small organic molecule
Emp. Form.:
C16H16N4O
Mol. Mass.:
280.3244
SMILES:
CC(NC(=O)c1cnn2cc(C)cnc12)c1ccccc1
: