Target
Cannabinoid receptor 2
Ligand
BDBM50258738
Substrate
Meas. Tech.
ChEBML_1690669
IC50
439±n/a nM
Citation
 Nguyen, TGerman, NDecker, AMLangston, TLGamage, TFFarquhar, CELi, JXWiley, JLThomas, BFZhang, Y Novel Diarylurea Based Allosteric Modulators of the Cannabinoid CB1 Receptor: Evaluation of Importance of 6-Pyrrolidinylpyridinyl Substitution. J Med Chem 60:7410-7424 (2017)  
Target
Name:
Cannabinoid receptor 2
Synonyms:
CANNABINOID CB2 CB2 Cannabinoid CB2 receptor Cannabinoid receptor 2 mCB2
Type:
Enzyme Catalytic Domain
Mol. Mass.:
38220.43
Organism:
MOUSE
Description:
P47936
Residue:
347
  
Inhibitor
Name:
BDBM50258738
Synonyms:
CHEMBL4070648
Type:
Small organic molecule
Emp. Form.:
C19H15ClN2O
Mol. Mass.:
322.788
SMILES:
Clc1ccc(NC(=O)Nc2cccc(c2)-c2ccccc2)cc1
: