Target
Cannabinoid receptor 2
Ligand
BDBM50258769
Substrate
Meas. Tech.
ChEBML_1690669
IC50
353±n/a nM
Citation
 Nguyen, TGerman, NDecker, AMLangston, TLGamage, TFFarquhar, CELi, JXWiley, JLThomas, BFZhang, Y Novel Diarylurea Based Allosteric Modulators of the Cannabinoid CB1 Receptor: Evaluation of Importance of 6-Pyrrolidinylpyridinyl Substitution. J Med Chem 60:7410-7424 (2017)  
Target
Name:
Cannabinoid receptor 2
Synonyms:
CANNABINOID CB2 CB2 Cannabinoid CB2 receptor Cannabinoid receptor 2 mCB2
Type:
Enzyme Catalytic Domain
Mol. Mass.:
38220.43
Organism:
MOUSE
Description:
P47936
Residue:
347
  
Inhibitor
Name:
BDBM50258769
Synonyms:
CHEMBL4096928
Type:
Small organic molecule
Emp. Form.:
C19H13ClF2N2O
Mol. Mass.:
358.769
SMILES:
Fc1ccc(c(F)c1)-c1cccc(NC(=O)Nc2ccc(Cl)cc2)c1
: