Target
5-hydroxytryptamine receptor 1A
Ligand
BDBM50412779
Substrate
Meas. Tech.
ChEBML_1691076
Ki
39±n/a nM
Citation
 Del Bello, FBonifazi, AGiannella, MGiorgioni, GPiergentili, APetrelli, RCifani, CMicioni Di Bonaventura, MVKeck, TMMazzolari, AVistoli, GCilia, APoggesi, EMatucci, RQuaglia, W The replacement of the 2-methoxy substituent of N-((6,6-diphenyl-1,4-dioxan-2-yl)methyl)-2-(2-methoxyphenoxy)ethan-1-amine improves the selectivity for 5-HT Eur J Med Chem 125:233-244 (2017)  
Target
Name:
5-hydroxytryptamine receptor 1A
Synonyms:
5-HT-1A 5-hydroxytryptamine receptor 1A (5-HT-1A) ADRB2RL1 Dopamine D2 receptor and serotonin 1a receptor HTR1A | Serotonin receptor 1A
Type:
Mol. Mass.:
46122.49
Organism:
Homo sapiens (Human)
Description:
Residue:
422
  
Inhibitor
Name:
BDBM50412779
Synonyms:
CHEMBL494908
Type:
Small organic molecule
Emp. Form.:
C20H25NO4
Mol. Mass.:
343.4168
SMILES:
COc1ccccc1OCCNC[C@@H]1CO[C@H](CO1)c1ccccc1
: