Target
5-hydroxytryptamine receptor 1A
Ligand
BDBM50259019
Substrate
Meas. Tech.
ChEBML_1691076
Ki
37±n/a nM
Citation
 Del Bello, FBonifazi, AGiannella, MGiorgioni, GPiergentili, APetrelli, RCifani, CMicioni Di Bonaventura, MVKeck, TMMazzolari, AVistoli, GCilia, APoggesi, EMatucci, RQuaglia, W The replacement of the 2-methoxy substituent of N-((6,6-diphenyl-1,4-dioxan-2-yl)methyl)-2-(2-methoxyphenoxy)ethan-1-amine improves the selectivity for 5-HT Eur J Med Chem 125:233-244 (2017)  
Target
Name:
5-hydroxytryptamine receptor 1A
Synonyms:
5-HT-1A 5-hydroxytryptamine receptor 1A (5-HT-1A) ADRB2RL1 Dopamine D2 receptor and serotonin 1a receptor HTR1A | Serotonin receptor 1A
Type:
Mol. Mass.:
46122.49
Organism:
Homo sapiens (Human)
Description:
Residue:
422
  
Inhibitor
Name:
BDBM50259019
Synonyms:
CHEMBL4079031
Type:
Small organic molecule
Emp. Form.:
C25H27NO3
Mol. Mass.:
389.4868
SMILES:
C(COc1ccccc1)NCC1COC(CO1)(c1ccccc1)c1ccccc1
: