Target
Neuronal acetylcholine receptor subunit alpha-7
Ligand
BDBM50259923
Substrate
Meas. Tech.
ChEBML_1691998
EC50
62±n/a nM
Citation
 Hill, MDFang, HDigavalli, SVHealy, FLGallagher, LPost-Munson, DChen, PNatale, JBenitex, YMorgan, DLodge, NBristow, LMacor, JEOlson, RE Development of spiroguanidine-derived?7 neuronal nicotinic receptor partial agonists. Bioorg Med Chem Lett 27:578-581 (2017)  
Target
Name:
Neuronal acetylcholine receptor subunit alpha-7
Synonyms:
ACHA7_HUMAN Cholinergic, Nicotinic Alpha7 Neuronal acetylcholine receptor protein alpha-7 subunit Nicotinic acetylcholine receptor alpha-7 (alpha7 nAChR)
Type:
Mol. Mass.:
56448.33
Organism:
Homo sapiens (Human)
Description:
CHRNA7 (NACHRA7)
Residue:
502
  
Inhibitor
Name:
BDBM50259923
Synonyms:
CHEMBL4078355
Type:
Small organic molecule
Emp. Form.:
C15H18ClN7
Mol. Mass.:
331.803
SMILES:
Clc1ccc2c(NC3=NCC4(CN5CCC4CC5)N3)ncnn12
: